Quick Links: Download Gideros Studio | Gideros Documentation | Gideros Development Center | Gideros community chat
"A problem occurred evaluating project ':app'. > Invalid revision:" - Page 2 - Gideros Forum

"A problem occurred evaluating project ':app'. > Invalid revision:"

2»

Comments

  • Well, hgy29, that was it. It worked in mt rebuilding/troubleshhoting version, so I applied this (excluding the module file from execution) to the full current version and it worked. So now I can continue developing this project.

    Thanks a bazillion, hgy29.

    Oleg, I can see that what you suggested would work, but by excluding the file from execution, I can keep the module structure intact with M as a local variable. Thanks.

    And keszegh, it has been my intention to look at versioning once I complete this project and if I want to continue with game development. Thanks.

    Likes: hgy29

    +1 -1 (+1 / -0 ) Share on Facebook
  • olegoleg Member
    edited January 2018
    @rpallen do it as you like

    just need to know all the options


    ps/

    you have 2 variable "question"-global and "M" local

    instead of 1 global


    I do not understand English
    I am writing with the help of a google translator

    my blog: https://simartinfo.blogspot.com
    my games:
    https://play.google.com/store/apps/developer?id=AndroidMobileGame+(indie)
    Слава Україні
  • rpallenrpallen Member
    edited January 2018
    I apologize for posting my previous comment twice. After I posted it the first time I didn't see it, so I posted it again. I didn't notice that there was a second page for this thread and that my post was on the second page.
  • adityaaditya Member
    edited February 15
    Same. I get Invalid Revision and not able to build apk. I have v27 installed.

    Project evaluation failed including an error in afterEvaluate {}. Run with --stacktrace for details of the afterEvaluate {} error.

    FAILURE: Build failed with an exception.

    * Where:
    Build file 'D:\test\taskproject\tmp\app\build.gradle' line: 4

    * What went wrong:
    A problem occurred evaluating project ':app'.
    > Invalid revision:

    * Try:
    Run with --stacktrace option to get the stack trace. Run with --info or --debug option to get more log output. Run with --scan to get full insights.

    * Get more help at https://help.gradle.org

    BUILD FAILED in 2s
    Exec returned: 1
    Export failed! See details above.
    Loon Games LinkedIn Facebook Twitter - "Something bit me, gaah!"
  • adityaaditya Member
    edited February 18
    @hgy29 @oleg can anyone please help?
    Loon Games LinkedIn Facebook Twitter - "Something bit me, gaah!"
  • hgy29hgy29 Maintainer
    @aditya, can you post a full export log ? There isn't enough information in the bit you posted.
  • adityaaditya Member
    edited February 18
    I updated the android sdk and that error went away, only to be replaced with this:
    [Fatal Error] :3:214: The value of attribute "name" associated with an element type "item" must not contain the "(Less than Sign)" character.
    Could not read D:\android-sdk\platform-tools\api\annotations.zip
    Full Log:
    Java Path:C:/Program Files/Java/jdk1.8.0_191
    Android SDK Path:D:/android-sdk
    Android SDK Version:27
    Android Build Tools:28.0.3
    0
    Set: project.package -> com.sg.apkmanager
    Set: local.noSigning -> //
    Set: local.isUnsigned -> -unsigned
    Replaced export.keyAlias by my_key_alias @7
    0
    If: 1
    0
    Ask: secret.keyStorePass -> ******
    Replaced secret.keyStorePass by ****** @7
    0
    If: 1
    0
    0
    Replaced export.keyStore by D:/my_private_key.keystore @13
    Ask: secret.keyAliasPass -> ******
    Set: local.noSigning ->
    Set: local.isUnsigned ->
    0
    If: 1
    RmDir: tmp
    MkDir: tmp
    Cd: tmp
    0
    If: 0
    Replaced project.autorotation by 0 @7
    0
    If: 1
    Set: local.orientation -> portrait
    Replaced project.orientation by 0 @6
    0
    If: 0
    Replaced project.orientation by 0 @6
    0
    If: 0
    Replaced project.orientation by 0 @6
    0
    If: 0
    Set: local.showSplash -> true
    Set: local.splashTheme -> @style/Theme.Splash
    Replaced project.disableSplash by 0 @6
    0
    If: 0
    0
    0
    0
    0
    0
    Replaced export.androidTarget by 27 @26
    Replaced project.version_code by 27 @21
    Replaced project.version by 1.0 @21
    Replaced local.orientation by portrait @27
    Replaced local.showSplash by true @21
    Replaced local.splashTheme by @style/Theme.Splash @15
    Replaced project.backgroundColor by #ffffff @15
    Replaced project.backgroundColor by #ffffff @18
    Replaced export.androidSdk by 27 @18
    Replaced export.androidTools by 28.0.3 @19
    Replaced export.androidTarget by 27 @17
    0
    0
    0
    0
    0
    0
    Template: Android Template from [C:/Program Files (x86)/Gideros/Templates/AndroidStudio/Android Template] to []
    Processing template
    Copying D:/test/New folder (2)/New folder/Casino File Manager/tmp/Casino File Manager.iml
    Updating D:/test/New folder (2)/New folder/Casino File Manager/tmp/build.gradle
    Updated:12 replacements
    Copying D:/test/New folder (2)/New folder/Casino File Manager/tmp/gradle.properties
    Copying D:/test/New folder (2)/New folder/Casino File Manager/tmp/gradlew
    Copying D:/test/New folder (2)/New folder/Casino File Manager/tmp/gradlew.bat
    Updating D:/test/New folder (2)/New folder/Casino File Manager/tmp/settings.gradle
    Updated:12 replacements
    Copying D:/test/New folder (2)/New folder/Casino File Manager/tmp/app/app.iml
    Updating D:/test/New folder (2)/New folder/Casino File Manager/tmp/app/build.gradle
    Updated:15 replacements
    Copying D:/test/New folder (2)/New folder/Casino File Manager/tmp/app/libs/gideros.jar
    Updating D:/test/New folder (2)/New folder/Casino File Manager/tmp/app/src/main/AndroidManifest.xml
    Updated:12 replacements
    Updating D:/test/New folder (2)/New folder/Casino File Manager/tmp/app/src/main/java/com/giderosmobile/android/CasinoFileManagerActivity.java
    Updated:12 replacements
    Updating D:/test/New folder (2)/New folder/Casino File Manager/tmp/app/src/main/java/com/giderosmobile/android/GiderosSettings.java
    Updated:12 replacements
    Updating D:/test/New folder (2)/New folder/Casino File Manager/tmp/app/src/main/jniLibs/arm64-v8a/libgideros.so
    Updated:0 replacements
    Copying D:/test/New folder (2)/New folder/Casino File Manager/tmp/app/src/main/jniLibs/arm64-v8a/libgvfs.so
    Copying D:/test/New folder (2)/New folder/Casino File Manager/tmp/app/src/main/jniLibs/arm64-v8a/liblua.so
    Updating D:/test/New folder (2)/New folder/Casino File Manager/tmp/app/src/main/jniLibs/armeabi/libgideros.so
    Updated:0 replacements
    Copying D:/test/New folder (2)/New folder/Casino File Manager/tmp/app/src/main/jniLibs/armeabi/libgvfs.so
    Copying D:/test/New folder (2)/New folder/Casino File Manager/tmp/app/src/main/jniLibs/armeabi/liblua.so
    Updating D:/test/New folder (2)/New folder/Casino File Manager/tmp/app/src/main/jniLibs/armeabi-v7a/libgideros.so
    Updated:0 replacements
    Copying D:/test/New folder (2)/New folder/Casino File Manager/tmp/app/src/main/jniLibs/armeabi-v7a/libgvfs.so
    Copying D:/test/New folder (2)/New folder/Casino File Manager/tmp/app/src/main/jniLibs/armeabi-v7a/liblua.so
    Updating D:/test/New folder (2)/New folder/Casino File Manager/tmp/app/src/main/jniLibs/mips/libgideros.so
    Updated:0 replacements
    Copying D:/test/New folder (2)/New folder/Casino File Manager/tmp/app/src/main/jniLibs/mips/libgvfs.so
    Copying D:/test/New folder (2)/New folder/Casino File Manager/tmp/app/src/main/jniLibs/mips/liblua.so
    Updating D:/test/New folder (2)/New folder/Casino File Manager/tmp/app/src/main/jniLibs/mips64/libgideros.so
    Updated:0 replacements
    Copying D:/test/New folder (2)/New folder/Casino File Manager/tmp/app/src/main/jniLibs/mips64/libgvfs.so
    Copying D:/test/New folder (2)/New folder/Casino File Manager/tmp/app/src/main/jniLibs/mips64/liblua.so
    Updating D:/test/New folder (2)/New folder/Casino File Manager/tmp/app/src/main/jniLibs/x86/libgideros.so
    Updated:0 replacements
    Copying D:/test/New folder (2)/New folder/Casino File Manager/tmp/app/src/main/jniLibs/x86/libgvfs.so
    Copying D:/test/New folder (2)/New folder/Casino File Manager/tmp/app/src/main/jniLibs/x86/liblua.so
    Updating D:/test/New folder (2)/New folder/Casino File Manager/tmp/app/src/main/jniLibs/x86_64/libgideros.so
    Updated:0 replacements
    Copying D:/test/New folder (2)/New folder/Casino File Manager/tmp/app/src/main/jniLibs/x86_64/libgvfs.so
    Copying D:/test/New folder (2)/New folder/Casino File Manager/tmp/app/src/main/jniLibs/x86_64/liblua.so
    Copying D:/test/New folder (2)/New folder/Casino File Manager/tmp/app/src/main/res/drawable/banner.png
    Copying D:/test/New folder (2)/New folder/Casino File Manager/tmp/app/src/main/res/drawable/icon.png
    Updating D:/test/New folder (2)/New folder/Casino File Manager/tmp/app/src/main/res/drawable/splash_bg.xml
    Updated:13 replacements
    Copying D:/test/New folder (2)/New folder/Casino File Manager/tmp/app/src/main/res/drawable-hdpi/icon.png
    Copying D:/test/New folder (2)/New folder/Casino File Manager/tmp/app/src/main/res/drawable-hdpi/splash.png
    Copying D:/test/New folder (2)/New folder/Casino File Manager/tmp/app/src/main/res/drawable-ldpi/icon.png
    Copying D:/test/New folder (2)/New folder/Casino File Manager/tmp/app/src/main/res/drawable-ldpi/splash.png
    Copying D:/test/New folder (2)/New folder/Casino File Manager/tmp/app/src/main/res/drawable-mdpi/icon.png
    Copying D:/test/New folder (2)/New folder/Casino File Manager/tmp/app/src/main/res/drawable-mdpi/splash.png
    Copying D:/test/New folder (2)/New folder/Casino File Manager/tmp/app/src/main/res/drawable-xhdpi/icon.png
    Copying D:/test/New folder (2)/New folder/Casino File Manager/tmp/app/src/main/res/drawable-xhdpi/ouya_icon.png
    Copying D:/test/New folder (2)/New folder/Casino File Manager/tmp/app/src/main/res/drawable-xhdpi/splash.png
    Copying D:/test/New folder (2)/New folder/Casino File Manager/tmp/app/src/main/res/drawable-xxhdpi/icon.png
    Copying D:/test/New folder (2)/New folder/Casino File Manager/tmp/app/src/main/res/drawable-xxhdpi/splash.png
    Copying D:/test/New folder (2)/New folder/Casino File Manager/tmp/app/src/main/res/drawable-xxxhdpi/icon.png
    Copying D:/test/New folder (2)/New folder/Casino File Manager/tmp/app/src/main/res/drawable-xxxhdpi/splash.png
    Updating D:/test/New folder (2)/New folder/Casino File Manager/tmp/app/src/main/res/layout/splash.xml
    Updated:12 replacements
    Updating D:/test/New folder (2)/New folder/Casino File Manager/tmp/app/src/main/res/values/strings.xml
    Updated:12 replacements
    Updating D:/test/New folder (2)/New folder/Casino File Manager/tmp/app/src/main/res/values/theme.xml
    Updated:12 replacements
    Copying D:/test/New folder (2)/New folder/Casino File Manager/tmp/gradle/wrapper/gradle-wrapper.jar
    Copying D:/test/New folder (2)/New folder/Casino File Manager/tmp/gradle/wrapper/gradle-wrapper.properties
    Replaced sys.exporType by @6
    0
    If: 0
    MkDir: app/src/main/assets/assets
    Cd: app/src/main/assets/assets
    Cd: ../../../../..
    Image(Type 1): 36x36 app/src/main/res/drawable-ldpi/icon.png
    Generating app icon (36x36)
    Image(Type 1): 48x48 app/src/main/res/drawable-mdpi/icon.png
    Generating app icon (48x48)
    Image(Type 1): 72x72 app/src/main/res/drawable-hdpi/icon.png
    Generating app icon (72x72)
    Image(Type 1): 96x96 app/src/main/res/drawable-xhdpi/icon.png
    Generating app icon (96x96)
    Image(Type 1): 96x96 app/src/main/res/drawable/icon.png
    Generating app icon (96x96)
    Image(Type 1): 144x144 app/src/main/res/drawable-xxhdpi/icon.png
    Generating app icon (144x144)
    Image(Type 1): 192x192 app/src/main/res/drawable-xxxhdpi/icon.png
    Generating app icon (192x192)
    Image(Type 2): 732x412 app/src/main/res/drawable-xhdpi/ouya_icon.png
    Generating TV icon (732x412)
    Image(Type 2): 320x180 app/src/main/res/drawable/banner.png
    Generating TV icon (320x180)
    Replaced project.orientation by 0 @15
    Replaced band:0:1 by 0 @7
    0
    If: 1
    Image(Type 3): 200x320 app/src/main/res/drawable-ldpi/splash.png
    Generating splash vertical (200x320) scale mode (0)
    Image(Type 3): 320x480 app/src/main/res/drawable-mdpi/splash.png
    Generating splash vertical (320x480) scale mode (0)
    Image(Type 3): 480x800 app/src/main/res/drawable-hdpi/splash.png
    Generating splash vertical (480x800) scale mode (0)
    Image(Type 3): 720x1280 app/src/main/res/drawable-xhdpi/splash.png
    Generating splash vertical (720x1280) scale mode (0)
    Image(Type 3): 960x1600 app/src/main/res/drawable-xxhdpi/splash.png
    Generating splash vertical (960x1600) scale mode (0)
    Image(Type 3): 1280x1920 app/src/main/res/drawable-xxxhdpi/splash.png
    Generating splash vertical (1280x1920) scale mode (0)
    Replaced project.orientation by 0 @8
    0
    If: 0
    Applying plugins
    0
    If: 1
    Set: local.gradleCmd -> "cmd.exe" /c gradlew.bat
    Replaced sys.exeExtension by .exe @7
    0
    If: 0
    Replaced local.gradleCmd by "cmd.exe" /c gradlew.bat @5
    0
    0
    Exec: "cmd.exe" /c gradlew.bat assembleRelease into D:/test/New folder (2)/New folder/Casino File Manager/tmp
    Observed package id 'build-tools;28.0.0-rc2' in inconsistent location 'D:\android-sdk\build-tools\28.0.0-preview' (Expected 'D:\android-sdk\build-tools\28.0.0-rc2')
    Incremental java compilation is an incubating feature.
    :app:preBuild UP-TO-DATE
    :app:preReleaseBuild UP-TO-DATE
    :app:checkReleaseManifest
    :app:prepareReleaseDependencies
    :app:compileReleaseAidl
    :app:compileReleaseRenderscript
    :app:generateReleaseBuildConfig
    :app:mergeReleaseShaders
    :app:compileReleaseShaders
    :app:generateReleaseAssets
    :app:mergeReleaseAssets
    :app:generateReleaseResValues
    :app:generateReleaseResources
    :app:mergeReleaseResources
    :app:processReleaseManifest
    :app:processReleaseResources
    :app:generateReleaseSources
    :app:incrementalReleaseJavaCompilationSafeguard
    :app:compileReleaseJavaWithJavac
    :app:compileReleaseJavaWithJavac - is not incremental (e.g. outputs have changed, no previous execution, etc.).
    :app:compileReleaseNdk UP-TO-DATE
    :app:compileReleaseSources
    [Fatal Error] :3:214: The value of attribute "name" associated with an element type "item" must not contain the '<' character.
    Could not read D:\android-sdk\platform-tools\api\annotations.zip
    java.io.IOException: Could not parse XML from android/accounts/annotations.xml
    at com.android.tools.lint.ExternalAnnotationRepository$AnnotationsDatabase.initializePackage(ExternalAnnotationRepository.java:658)
    at com.android.tools.lint.ExternalAnnotationRepository$AnnotationsDatabase.initializeFromJar(ExternalAnnotationRepository.java:601)
    at com.android.tools.lint.ExternalAnnotationRepository$AnnotationsDatabase.<init>(ExternalAnnotationRepository.java:402)
    at com.android.tools.lint.ExternalAnnotationRepository.getDatabase(ExternalAnnotationRepository.java:214)
    at com.android.tools.lint.ExternalAnnotationRepository.create(ExternalAnnotationRepository.java:153)
    at com.android.tools.lint.ExternalAnnotationRepository.get(ExternalAnnotationRepository.java:134)
    at com.android.tools.lint.EcjParser$EcjResolvedMethod.getAnnotations(EcjParser.java:1374)
    at com.android.tools.lint.checks.SupportAnnotationDetector$CallVisitor.checkCall(SupportAnnotationDetector.java:1688)
    at com.android.tools.lint.checks.SupportAnnotationDetector$CallVisitor.visitMethodInvocation(SupportAnnotationDetector.java:1659)
    at com.android.tools.lint.client.api.JavaVisitor$DispatchVisitor.visitMethodInvocation(JavaVisitor.java:1077)
    at com.android.tools.lint.client.api.JavaVisitor$DelegatingJavaVisitor.visitMethodInvocation(JavaVisitor.java:1445)
    at lombok.ast.MethodInvocation.accept(MethodInvocation.java:114)
    at lombok.ast.ExpressionStatement.accept(ExpressionStatement.java:63)
    at lombok.ast.Block.accept(Block.java:106)
    at lombok.ast.StaticInitializer.accept(StaticInitializer.java:63)
    at lombok.ast.NormalTypeBody.accept(NormalTypeBody.java:57)
    at lombok.ast.ClassDeclaration.accept(ClassDeclaration.java:239)
    at lombok.ast.CompilationUnit.accept(CompilationUnit.java:83)
    at com.android.tools.lint.client.api.JavaVisitor.visitFile(JavaVisitor.java:274)
    at com.android.tools.lint.client.api.LintDriver.checkJava(LintDriver.java:1529)
    at com.android.tools.lint.client.api.LintDriver.runFileDetectors(LintDriver.java:1063)
    at com.android.tools.lint.client.api.LintDriver.checkProject(LintDriver.java:908)
    at com.android.tools.lint.client.api.LintDriver.analyze(LintDriver.java:436)
    at com.android.tools.lint.client.api.LintDriver.analyze(LintDriver.java:377)
    at com.android.tools.lint.LintCliClient.run(LintCliClient.java:131)
    at com.android.build.gradle.internal.LintGradleClient.run(LintGradleClient.java:133)
    at com.android.build.gradle.internal.LintGradleClient$run.call(Unknown Source)
    at org.codehaus.groovy.runtime.callsite.CallSiteArray.defaultCall(CallSiteArray.java:48)
    at org.codehaus.groovy.runtime.callsite.AbstractCallSite.call(AbstractCallSite.java:113)
    at org.codehaus.groovy.runtime.callsite.AbstractCallSite.call(AbstractCallSite.java:125)
    at com.android.build.gradle.tasks.Lint.runLint(Lint.groovy:223)
    at sun.reflect.NativeMethodAccessorImpl.invoke0(Native Method)
    at sun.reflect.NativeMethodAccessorImpl.invoke(NativeMethodAccessorImpl.java:62)
    at sun.reflect.DelegatingMethodAccessorImpl.invoke(DelegatingMethodAccessorImpl.java:43)
    at java.lang.reflect.Method.invoke(Method.java:498)
    at org.codehaus.groovy.runtime.callsite.PogoMetaMethodSite$PogoCachedMethodSiteNoUnwrapNoCoerce.invoke(PogoMetaMethodSite.java:210)
    at org.codehaus.groovy.runtime.callsite.PogoMetaMethodSite.callCurrent(PogoMetaMethodSite.java:59)
    at org.codehaus.groovy.runtime.callsite.CallSiteArray.defaultCallCurrent(CallSiteArray.java:52)
    at org.codehaus.groovy.runtime.callsite.AbstractCallSite.callCurrent(AbstractCallSite.java:154)
    at org.codehaus.groovy.runtime.callsite.AbstractCallSite.callCurrent(AbstractCallSite.java:182)
    at com.android.build.gradle.tasks.Lint.lintSingleVariant(Lint.groovy:198)
    at com.android.build.gradle.tasks.Lint$lintSingleVariant$2.callCurrent(Unknown Source)
    at org.codehaus.groovy.runtime.callsite.CallSiteArray.defaultCallCurrent(CallSiteArray.java:52)
    at org.codehaus.groovy.runtime.callsite.AbstractCallSite.callCurrent(AbstractCallSite.java:154)
    at org.codehaus.groovy.runtime.callsite.AbstractCallSite.callCurrent(AbstractCallSite.java:174)
    at com.android.build.gradle.tasks.Lint.lint(Lint.groovy:77)
    at sun.reflect.NativeMethodAccessorImpl.invoke0(Native Method)
    at sun.reflect.NativeMethodAccessorImpl.invoke(NativeMethodAccessorImpl.java:62)
    at sun.reflect.DelegatingMethodAccessorImpl.invoke(DelegatingMethodAccessorImpl.java:43)
    at java.lang.reflect.Method.invoke(Method.java:498)
    at org.gradle.internal.reflect.JavaMethod.invoke(JavaMethod.java:75)
    at org.gradle.api.internal.project.taskfactory.AnnotationProcessingTaskFactory$StandardTaskAction.doExecute(AnnotationProcessingTaskFactory.java:228)
    at org.gradle.api.internal.project.taskfactory.AnnotationProcessingTaskFactory$StandardTaskAction.execute(AnnotationProcessingTaskFactory.java:221)
    at org.gradle.api.internal.project.taskfactory.AnnotationProcessingTaskFactory$StandardTaskAction.execute(AnnotationProcessingTaskFactory.java:210)
    at org.gradle.api.internal.AbstractTask$TaskActionWrapper.execute(AbstractTask.java:621)
    at org.gradle.api.internal.AbstractTask$TaskActionWrapper.execute(AbstractTask.java:604)
    at org.gradle.api.internal.tasks.execution.ExecuteActionsTaskExecuter.executeAction(ExecuteActionsTaskExecuter.java:80)
    at org.gradle.api.internal.tasks.execution.ExecuteActionsTaskExecuter.executeActions(ExecuteActionsTaskExecuter.java:61)
    at org.gradle.api.internal.tasks.execution.ExecuteActionsTaskExecuter.execute(ExecuteActionsTaskExecuter.java:46)
    at org.gradle.api.internal.tasks.execution.PostExecutionAnalysisTaskExecuter.execute(PostExecutionAnalysisTaskExecuter.java:35)
    at org.gradle.api.internal.tasks.execution.SkipUpToDateTaskExecuter.execute(SkipUpToDateTaskExecuter.java:66)
    at org.gradle.api.internal.tasks.execution.ValidatingTaskExecuter.execute(ValidatingTaskExecuter.java:58)
    at org.gradle.api.internal.tasks.execution.SkipEmptySourceFilesTaskExecuter.execute(SkipEmptySourceFilesTaskExecuter.java:52)
    at org.gradle.api.internal.tasks.execution.SkipTaskWithNoActionsExecuter.execute(SkipTaskWithNoActionsExecuter.java:52)
    at org.gradle.api.internal.tasks.execution.SkipOnlyIfTaskExecuter.execute(SkipOnlyIfTaskExecuter.java:53)
    at org.gradle.api.internal.tasks.execution.ExecuteAtMostOnceTaskExecuter.execute(ExecuteAtMostOnceTaskExecuter.java:43)
    at org.gradle.execution.taskgraph.DefaultTaskGraphExecuter$EventFiringTaskWorker.execute(DefaultTaskGraphExecuter.java:203)
    at org.gradle.execution.taskgraph.DefaultTaskGraphExecuter$EventFiringTaskWorker.execute(DefaultTaskGraphExecuter.java:185)
    at org.gradle.execution.taskgraph.AbstractTaskPlanExecutor$TaskExecutorWorker.processTask(AbstractTaskPlanExecutor.java:66)
    at org.gradle.execution.taskgraph.AbstractTaskPlanExecutor$TaskExecutorWorker.run(AbstractTaskPlanExecutor.java:50)
    at org.gradle.execution.taskgraph.DefaultTaskPlanExecutor.process(DefaultTaskPlanExecutor.java:25)
    at org.gradle.execution.taskgraph.DefaultTaskGraphExecuter.execute(DefaultTaskGraphExecuter.java:110)
    at org.gradle.execution.SelectedTaskExecutionAction.execute(SelectedTaskExecutionAction.java:37)
    at org.gradle.execution.DefaultBuildExecuter.execute(DefaultBuildExecuter.java:37)
    at org.gradle.execution.DefaultBuildExecuter.access$000(DefaultBuildExecuter.java:23)
    at org.gradle.execution.DefaultBuildExecuter$1.proceed(DefaultBuildExecuter.java:43)
    at org.gradle.execution.DryRunBuildExecutionAction.execute(DryRunBuildExecutionAction.java:32)
    at org.gradle.execution.DefaultBuildExecuter.execute(DefaultBuildExecuter.java:37)
    at org.gradle.execution.DefaultBuildExecuter.execute(DefaultBuildExecuter.java:30)
    at org.gradle.initialization.DefaultGradleLauncher$4.run(DefaultGradleLauncher.java:153)
    at org.gradle.internal.Factories$1.create(Factories.java:22)
    at org.gradle.internal.progress.DefaultBuildOperationExecutor.run(DefaultBuildOperationExecutor.java:91)
    at org.gradle.internal.progress.DefaultBuildOperationExecutor.run(DefaultBuildOperationExecutor.java:53)
    at org.gradle.initialization.DefaultGradleLauncher.doBuildStages(DefaultGradleLauncher.java:150)
    at org.gradle.initialization.DefaultGradleLauncher.access$200(DefaultGradleLauncher.java:32)
    at org.gradle.initialization.DefaultGradleLauncher$1.create(DefaultGradleLauncher.java:98)
    at org.gradle.initialization.DefaultGradleLauncher$1.create(DefaultGradleLauncher.java:92)
    at org.gradle.internal.progress.DefaultBuildOperationExecutor.run(DefaultBuildOperationExecutor.java:91)
    at org.gradle.internal.progress.DefaultBuildOperationExecutor.run(DefaultBuildOperationExecutor.java:63)
    at org.gradle.initialization.DefaultGradleLauncher.doBuild(DefaultGradleLauncher.java:92)
    at org.gradle.initialization.DefaultGradleLauncher.run(DefaultGradleLauncher.java:83)
    at org.gradle.launcher.exec.InProcessBuildActionExecuter$DefaultBuildController.run(InProcessBuildActionExecuter.java:99)
    at org.gradle.tooling.internal.provider.ExecuteBuildActionRunner.run(ExecuteBuildActionRunner.java:28)
    at org.gradle.launcher.exec.ChainingBuildActionRunner.run(ChainingBuildActionRunner.java:35)
    at org.gradle.launcher.exec.InProcessBuildActionExecuter.execute(InProcessBuildActionExecuter.java:48)
    at org.gradle.launcher.exec.InProcessBuildActionExecuter.execute(InProcessBuildActionExecuter.java:30)
    at org.gradle.launcher.exec.ContinuousBuildActionExecuter.execute(ContinuousBuildActionExecuter.java:81)
    at org.gradle.launcher.exec.ContinuousBuildActionExecuter.execute(ContinuousBuildActionExecuter.java:46)
    at org.gradle.launcher.exec.DaemonUsageSuggestingBuildActionExecuter.execute(DaemonUsageSuggestingBuildActionExecuter.java:51)
    at org.gradle.launcher.exec.DaemonUsageSuggestingBuildActionExecuter.execute(DaemonUsageSuggestingBuildActionExecuter.java:28)
    at org.gradle.launcher.cli.RunBuildAction.run(RunBuildAction.java:43)
    at org.gradle.internal.Actions$RunnableActionAdapter.execute(Actions.java:173)
    at org.gradle.launcher.cli.CommandLineActionFactory$ParseAndBuildAction.execute(CommandLineActionFactory.java:239)
    at org.gradle.launcher.cli.CommandLineActionFactory$ParseAndBuildAction.execute(CommandLineActionFactory.java:212)
    at org.gradle.launcher.cli.JavaRuntimeValidationAction.execute(JavaRuntimeValidationAction.java:35)
    at org.gradle.launcher.cli.JavaRuntimeValidationAction.execute(JavaRuntimeValidationAction.java:24)
    at org.gradle.launcher.cli.ExceptionReportingAction.execute(ExceptionReportingAction.java:33)
    at org.gradle.launcher.cli.ExceptionReportingAction.execute(ExceptionReportingAction.java:22)
    at org.gradle.launcher.cli.CommandLineActionFactory$WithLogging.execute(CommandLineActionFactory.java:205)
    at org.gradle.launcher.cli.CommandLineActionFactory$WithLogging.execute(CommandLineActionFactory.java:169)
    at org.gradle.launcher.Main.doAction(Main.java:33)
    at org.gradle.launcher.bootstrap.EntryPoint.run(EntryPoint.java:45)
    at sun.reflect.NativeMethodAccessorImpl.invoke0(Native Method)
    at sun.reflect.NativeMethodAccessorImpl.invoke(NativeMethodAccessorImpl.java:62)
    at sun.reflect.DelegatingMethodAccessorImpl.invoke(DelegatingMethodAccessorImpl.java:43)
    at java.lang.reflect.Method.invoke(Method.java:498)
    at org.gradle.launcher.bootstrap.ProcessBootstrap.runNoExit(ProcessBootstrap.java:55)
    at org.gradle.launcher.bootstrap.ProcessBootstrap.run(ProcessBootstrap.java:36)
    at org.gradle.launcher.GradleMain.main(GradleMain.java:23)
    at sun.reflect.NativeMethodAccessorImpl.invoke0(Native Method)
    at sun.reflect.NativeMethodAccessorImpl.invoke(NativeMethodAccessorImpl.java:62)
    at sun.reflect.DelegatingMethodAccessorImpl.invoke(DelegatingMethodAccessorImpl.java:43)
    at java.lang.reflect.Method.invoke(Method.java:498)
    at org.gradle.wrapper.BootstrapMainStarter.start(BootstrapMainStarter.java:33)
    at org.gradle.wrapper.WrapperExecutor.execute(WrapperExecutor.java:130)
    at org.gradle.wrapper.GradleWrapperMain.main(GradleWrapperMain.java:48)
    :app:lintVitalRelease
    :app:prePackageMarkerForRelease
    :app:transformClassesWithDexForRelease
    To run dex in process, the Gradle daemon needs a larger heap.
    It currently has approximately 1724 MB.
    For faster builds, increase the maximum heap size for the Gradle daemon to more than 2048 MB.
    To do this set org.gradle.jvmargs=-Xmx2048M in the project gradle.properties.
    For more information see https://docs.gradle.org/current/userguide/build_environment.html
    :app:mergeReleaseJniLibFolders
    :app:transformNative_libsWithMergeJniLibsForRelease
    :app:processReleaseJavaRes UP-TO-DATE
    :app:transformResourcesWithMergeJavaResForRelease
    :app:validateReleaseSigning
    :app:packageRelease
    :app:zipalignRelease
    :app:assembleRelease

    BUILD SUCCESSFUL

    Total time: 31.585 secs
    Exec returned: 0
    Replaced project.namews by CasinoFileManager @3
    Replaced local.isUnsigned by @20
    Replaced local.isUnsigned by @33
    Cp: app/build/outputs/apk/app-release.apk -> ../CasinoFileManager.apk
    Cd: ..
    RmDir: tmp
    0
    If: 0
    Export done.
    Loon Games LinkedIn Facebook Twitter - "Something bit me, gaah!"
  • adityaaditya Member
    edited February 18
    I have 3 android sdks in my filesystem. If I select the one in C:\Program Files(x86)\Android\Android(sdk), I get 'invalid revision' error:

    Java Path:C:/Program Files/Java/jdk1.8.0_191
    Android SDK Path:C:/Program Files (x86)/Android/android-sdk
    Android SDK Version:27
    Android Build Tools:
    0
    Set: project.package -> com.sg.apkmanager
    Set: local.noSigning -> //
    Set: local.isUnsigned -> -unsigned
    Replaced export.keyAlias by my_key_alias @7
    0
    If: 1
    0
    Ask: secret.keyStorePass -> ******
    Replaced secret.keyStorePass by ****** @7
    0
    If: 1
    0
    0
    Replaced export.keyStore by D:/my_private_key.keystore @13
    Ask: secret.keyAliasPass -> ******
    Set: local.noSigning ->
    Set: local.isUnsigned ->
    0
    If: 1
    RmDir: tmp
    MkDir: tmp
    Cd: tmp
    0
    If: 0
    Replaced project.autorotation by 0 @7
    0
    If: 1
    Set: local.orientation -> portrait
    Replaced project.orientation by 0 @6
    0
    If: 0
    Replaced project.orientation by 0 @6
    0
    If: 0
    Replaced project.orientation by 0 @6
    0
    If: 0
    Set: local.showSplash -> true
    Set: local.splashTheme -> @style/Theme.Splash
    Replaced project.disableSplash by 0 @6
    0
    If: 0
    0
    0
    0
    0
    0
    Replaced export.androidTarget by 27 @26
    Replaced project.version_code by 27 @21
    Replaced project.version by 1.0 @21
    Replaced local.orientation by portrait @27
    Replaced local.showSplash by true @21
    Replaced local.splashTheme by @style/Theme.Splash @15
    Replaced project.backgroundColor by #ffffff @15
    Replaced project.backgroundColor by #ffffff @18
    Replaced export.androidSdk by 27 @18
    Replaced export.androidTools by @19
    Replaced export.androidTarget by 27 @17
    0
    0
    0
    0
    0
    0
    Template: Android Template from [C:/Program Files (x86)/Gideros/Templates/AndroidStudio/Android Template] to []
    Processing template
    Copying D:/test/New folder (2)/New folder/Casino File Manager/tmp/Casino File Manager.iml
    Updating D:/test/New folder (2)/New folder/Casino File Manager/tmp/build.gradle
    Updated:13 replacements
    Copying D:/test/New folder (2)/New folder/Casino File Manager/tmp/gradle.properties
    Copying D:/test/New folder (2)/New folder/Casino File Manager/tmp/gradlew
    Copying D:/test/New folder (2)/New folder/Casino File Manager/tmp/gradlew.bat
    Updating D:/test/New folder (2)/New folder/Casino File Manager/tmp/settings.gradle
    Updated:13 replacements
    Copying D:/test/New folder (2)/New folder/Casino File Manager/tmp/app/app.iml
    Updating D:/test/New folder (2)/New folder/Casino File Manager/tmp/app/build.gradle
    Updated:15 replacements
    Copying D:/test/New folder (2)/New folder/Casino File Manager/tmp/app/libs/gideros.jar
    Updating D:/test/New folder (2)/New folder/Casino File Manager/tmp/app/src/main/AndroidManifest.xml
    Updated:13 replacements
    Updating D:/test/New folder (2)/New folder/Casino File Manager/tmp/app/src/main/java/com/giderosmobile/android/CasinoFileManagerActivity.java
    Updated:13 replacements
    Updating D:/test/New folder (2)/New folder/Casino File Manager/tmp/app/src/main/java/com/giderosmobile/android/GiderosSettings.java
    Updated:13 replacements
    Updating D:/test/New folder (2)/New folder/Casino File Manager/tmp/app/src/main/jniLibs/arm64-v8a/libgideros.so
    Updated:0 replacements
    Copying D:/test/New folder (2)/New folder/Casino File Manager/tmp/app/src/main/jniLibs/arm64-v8a/libgvfs.so
    Copying D:/test/New folder (2)/New folder/Casino File Manager/tmp/app/src/main/jniLibs/arm64-v8a/liblua.so
    Updating D:/test/New folder (2)/New folder/Casino File Manager/tmp/app/src/main/jniLibs/armeabi/libgideros.so
    Updated:0 replacements
    Copying D:/test/New folder (2)/New folder/Casino File Manager/tmp/app/src/main/jniLibs/armeabi/libgvfs.so
    Copying D:/test/New folder (2)/New folder/Casino File Manager/tmp/app/src/main/jniLibs/armeabi/liblua.so
    Updating D:/test/New folder (2)/New folder/Casino File Manager/tmp/app/src/main/jniLibs/armeabi-v7a/libgideros.so
    Updated:0 replacements
    Copying D:/test/New folder (2)/New folder/Casino File Manager/tmp/app/src/main/jniLibs/armeabi-v7a/libgvfs.so
    Copying D:/test/New folder (2)/New folder/Casino File Manager/tmp/app/src/main/jniLibs/armeabi-v7a/liblua.so
    Updating D:/test/New folder (2)/New folder/Casino File Manager/tmp/app/src/main/jniLibs/mips/libgideros.so
    Updated:0 replacements
    Copying D:/test/New folder (2)/New folder/Casino File Manager/tmp/app/src/main/jniLibs/mips/libgvfs.so
    Copying D:/test/New folder (2)/New folder/Casino File Manager/tmp/app/src/main/jniLibs/mips/liblua.so
    Updating D:/test/New folder (2)/New folder/Casino File Manager/tmp/app/src/main/jniLibs/mips64/libgideros.so
    Updated:0 replacements
    Copying D:/test/New folder (2)/New folder/Casino File Manager/tmp/app/src/main/jniLibs/mips64/libgvfs.so
    Copying D:/test/New folder (2)/New folder/Casino File Manager/tmp/app/src/main/jniLibs/mips64/liblua.so
    Updating D:/test/New folder (2)/New folder/Casino File Manager/tmp/app/src/main/jniLibs/x86/libgideros.so
    Updated:0 replacements
    Copying D:/test/New folder (2)/New folder/Casino File Manager/tmp/app/src/main/jniLibs/x86/libgvfs.so
    Copying D:/test/New folder (2)/New folder/Casino File Manager/tmp/app/src/main/jniLibs/x86/liblua.so
    Updating D:/test/New folder (2)/New folder/Casino File Manager/tmp/app/src/main/jniLibs/x86_64/libgideros.so
    Updated:0 replacements
    Copying D:/test/New folder (2)/New folder/Casino File Manager/tmp/app/src/main/jniLibs/x86_64/libgvfs.so
    Copying D:/test/New folder (2)/New folder/Casino File Manager/tmp/app/src/main/jniLibs/x86_64/liblua.so
    Copying D:/test/New folder (2)/New folder/Casino File Manager/tmp/app/src/main/res/drawable/banner.png
    Copying D:/test/New folder (2)/New folder/Casino File Manager/tmp/app/src/main/res/drawable/icon.png
    Updating D:/test/New folder (2)/New folder/Casino File Manager/tmp/app/src/main/res/drawable/splash_bg.xml
    Updated:14 replacements
    Copying D:/test/New folder (2)/New folder/Casino File Manager/tmp/app/src/main/res/drawable-hdpi/icon.png
    Copying D:/test/New folder (2)/New folder/Casino File Manager/tmp/app/src/main/res/drawable-hdpi/splash.png
    Copying D:/test/New folder (2)/New folder/Casino File Manager/tmp/app/src/main/res/drawable-ldpi/icon.png
    Copying D:/test/New folder (2)/New folder/Casino File Manager/tmp/app/src/main/res/drawable-ldpi/splash.png
    Copying D:/test/New folder (2)/New folder/Casino File Manager/tmp/app/src/main/res/drawable-mdpi/icon.png
    Copying D:/test/New folder (2)/New folder/Casino File Manager/tmp/app/src/main/res/drawable-mdpi/splash.png
    Copying D:/test/New folder (2)/New folder/Casino File Manager/tmp/app/src/main/res/drawable-xhdpi/icon.png
    Copying D:/test/New folder (2)/New folder/Casino File Manager/tmp/app/src/main/res/drawable-xhdpi/ouya_icon.png
    Copying D:/test/New folder (2)/New folder/Casino File Manager/tmp/app/src/main/res/drawable-xhdpi/splash.png
    Copying D:/test/New folder (2)/New folder/Casino File Manager/tmp/app/src/main/res/drawable-xxhdpi/icon.png
    Copying D:/test/New folder (2)/New folder/Casino File Manager/tmp/app/src/main/res/drawable-xxhdpi/splash.png
    Copying D:/test/New folder (2)/New folder/Casino File Manager/tmp/app/src/main/res/drawable-xxxhdpi/icon.png
    Copying D:/test/New folder (2)/New folder/Casino File Manager/tmp/app/src/main/res/drawable-xxxhdpi/splash.png
    Updating D:/test/New folder (2)/New folder/Casino File Manager/tmp/app/src/main/res/layout/splash.xml
    Updated:13 replacements
    Updating D:/test/New folder (2)/New folder/Casino File Manager/tmp/app/src/main/res/values/strings.xml
    Updated:13 replacements
    Updating D:/test/New folder (2)/New folder/Casino File Manager/tmp/app/src/main/res/values/theme.xml
    Updated:13 replacements
    Copying D:/test/New folder (2)/New folder/Casino File Manager/tmp/gradle/wrapper/gradle-wrapper.jar
    Copying D:/test/New folder (2)/New folder/Casino File Manager/tmp/gradle/wrapper/gradle-wrapper.properties
    Replaced sys.exporType by @6
    0
    If: 0
    MkDir: app/src/main/assets/assets
    Cd: app/src/main/assets/assets
    Cd: ../../../../..
    Image(Type 1): 36x36 app/src/main/res/drawable-ldpi/icon.png
    Generating app icon (36x36)
    Image(Type 1): 48x48 app/src/main/res/drawable-mdpi/icon.png
    Generating app icon (48x48)
    Image(Type 1): 72x72 app/src/main/res/drawable-hdpi/icon.png
    Generating app icon (72x72)
    Image(Type 1): 96x96 app/src/main/res/drawable-xhdpi/icon.png
    Generating app icon (96x96)
    Image(Type 1): 96x96 app/src/main/res/drawable/icon.png
    Generating app icon (96x96)
    Image(Type 1): 144x144 app/src/main/res/drawable-xxhdpi/icon.png
    Generating app icon (144x144)
    Image(Type 1): 192x192 app/src/main/res/drawable-xxxhdpi/icon.png
    Generating app icon (192x192)
    Image(Type 2): 732x412 app/src/main/res/drawable-xhdpi/ouya_icon.png
    Generating TV icon (732x412)
    Image(Type 2): 320x180 app/src/main/res/drawable/banner.png
    Generating TV icon (320x180)
    Replaced project.orientation by 0 @15
    Replaced band:0:1 by 0 @7
    0
    If: 1
    Image(Type 3): 200x320 app/src/main/res/drawable-ldpi/splash.png
    Generating splash vertical (200x320) scale mode (0)
    Image(Type 3): 320x480 app/src/main/res/drawable-mdpi/splash.png
    Generating splash vertical (320x480) scale mode (0)
    Image(Type 3): 480x800 app/src/main/res/drawable-hdpi/splash.png
    Generating splash vertical (480x800) scale mode (0)
    Image(Type 3): 720x1280 app/src/main/res/drawable-xhdpi/splash.png
    Generating splash vertical (720x1280) scale mode (0)
    Image(Type 3): 960x1600 app/src/main/res/drawable-xxhdpi/splash.png
    Generating splash vertical (960x1600) scale mode (0)
    Image(Type 3): 1280x1920 app/src/main/res/drawable-xxxhdpi/splash.png
    Generating splash vertical (1280x1920) scale mode (0)
    Replaced project.orientation by 0 @8
    0
    If: 0
    Applying plugins
    0
    If: 1
    Set: local.gradleCmd -> "cmd.exe" /c gradlew.bat
    Replaced sys.exeExtension by .exe @7
    0
    If: 0
    Replaced local.gradleCmd by "cmd.exe" /c gradlew.bat @5
    0
    0
    Exec: "cmd.exe" /c gradlew.bat assembleRelease into D:/test/New folder (2)/New folder/Casino File Manager/tmp

    BUILD FAILED

    Total time: 9.313 secs
    Failed to notify ProjectEvaluationListener.afterEvaluate(), but primary configuration failure takes precedence.
    java.lang.IllegalStateException: buildToolsVersion is not specified.
    at com.google.common.base.Preconditions.checkState(Preconditions.java:176)
    at com.android.build.gradle.BasePlugin.createAndroidTasks(BasePlugin.java:606)
    at com.android.build.gradle.BasePlugin$10$1.call(BasePlugin.java:572)
    at com.android.build.gradle.BasePlugin$10$1.call(BasePlugin.java:569)
    at com.android.builder.profile.ThreadRecorder$1.record(ThreadRecorder.java:55)
    at com.android.builder.profile.ThreadRecorder$1.record(ThreadRecorder.java:47)
    at com.android.build.gradle.BasePlugin$10.execute(BasePlugin.java:568)
    at com.android.build.gradle.BasePlugin$10.execute(BasePlugin.java:565)
    at org.gradle.internal.event.BroadcastDispatch$ActionInvocationHandler.dispatch(BroadcastDispatch.java:93)
    at org.gradle.internal.event.BroadcastDispatch$ActionInvocationHandler.dispatch(BroadcastDispatch.java:82)
    at org.gradle.internal.event.AbstractBroadcastDispatch.dispatch(AbstractBroadcastDispatch.java:44)
    at org.gradle.internal.event.BroadcastDispatch.dispatch(BroadcastDispatch.java:79)
    at org.gradle.internal.event.BroadcastDispatch.dispatch(BroadcastDispatch.java:30)
    at org.gradle.internal.dispatch.ProxyDispatchAdapter$DispatchingInvocationHandler.invoke(ProxyDispatchAdapter.java:93)
    at com.sun.proxy.$Proxy12.afterEvaluate(Unknown Source)
    at org.gradle.configuration.project.LifecycleProjectEvaluator.notifyAfterEvaluate(LifecycleProjectEvaluator.java:67)
    at org.gradle.configuration.project.LifecycleProjectEvaluator.evaluate(LifecycleProjectEvaluator.java:61)
    at org.gradle.api.internal.project.AbstractProject.evaluate(AbstractProject.java:540)
    at org.gradle.api.internal.project.AbstractProject.evaluate(AbstractProject.java:93)
    at org.gradle.execution.TaskPathProjectEvaluator.configureHierarchy(TaskPathProjectEvaluator.java:47)
    at org.gradle.configuration.DefaultBuildConfigurer.configure(DefaultBuildConfigurer.java:35)
    at org.gradle.initialization.DefaultGradleLauncher$2.run(DefaultGradleLauncher.java:124)
    at org.gradle.internal.Factories$1.create(Factories.java:22)
    at org.gradle.internal.progress.DefaultBuildOperationExecutor.run(DefaultBuildOperationExecutor.java:91)
    at org.gradle.internal.progress.DefaultBuildOperationExecutor.run(DefaultBuildOperationExecutor.java:53)
    at org.gradle.initialization.DefaultGradleLauncher.doBuildStages(DefaultGradleLauncher.java:121)
    at org.gradle.initialization.DefaultGradleLauncher.access$200(DefaultGradleLauncher.java:32)
    at org.gradle.initialization.DefaultGradleLauncher$1.create(DefaultGradleLauncher.java:98)
    at org.gradle.initialization.DefaultGradleLauncher$1.create(DefaultGradleLauncher.java:92)
    at org.gradle.internal.progress.DefaultBuildOperationExecutor.run(DefaultBuildOperationExecutor.java:91)
    at org.gradle.internal.progress.DefaultBuildOperationExecutor.run(DefaultBuildOperationExecutor.java:63)
    at org.gradle.initialization.DefaultGradleLauncher.doBuild(DefaultGradleLauncher.java:92)
    at org.gradle.initialization.DefaultGradleLauncher.run(DefaultGradleLauncher.java:83)
    at org.gradle.launcher.exec.InProcessBuildActionExecuter$DefaultBuildController.run(InProcessBuildActionExecuter.java:99)
    at org.gradle.tooling.internal.provider.ExecuteBuildActionRunner.run(ExecuteBuildActionRunner.java:28)
    at org.gradle.launcher.exec.ChainingBuildActionRunner.run(ChainingBuildActionRunner.java:35)
    at org.gradle.launcher.exec.InProcessBuildActionExecuter.execute(InProcessBuildActionExecuter.java:48)
    at org.gradle.launcher.exec.InProcessBuildActionExecuter.execute(InProcessBuildActionExecuter.java:30)
    at org.gradle.launcher.exec.ContinuousBuildActionExecuter.execute(ContinuousBuildActionExecuter.java:81)
    at org.gradle.launcher.exec.ContinuousBuildActionExecuter.execute(ContinuousBuildActionExecuter.java:46)
    at org.gradle.launcher.exec.DaemonUsageSuggestingBuildActionExecuter.execute(DaemonUsageSuggestingBuildActionExecuter.java:51)
    at org.gradle.launcher.exec.DaemonUsageSuggestingBuildActionExecuter.execute(DaemonUsageSuggestingBuildActionExecuter.java:28)
    at org.gradle.launcher.cli.RunBuildAction.run(RunBuildAction.java:43)
    at org.gradle.internal.Actions$RunnableActionAdapter.execute(Actions.java:173)
    at org.gradle.launcher.cli.CommandLineActionFactory$ParseAndBuildAction.execute(CommandLineActionFactory.java:239)
    at org.gradle.launcher.cli.CommandLineActionFactory$ParseAndBuildAction.execute(CommandLineActionFactory.java:212)
    at org.gradle.launcher.cli.JavaRuntimeValidationAction.execute(JavaRuntimeValidationAction.java:35)
    at org.gradle.launcher.cli.JavaRuntimeValidationAction.execute(JavaRuntimeValidationAction.java:24)
    at org.gradle.launcher.cli.ExceptionReportingAction.execute(ExceptionReportingAction.java:33)
    at org.gradle.launcher.cli.ExceptionReportingAction.execute(ExceptionReportingAction.java:22)
    at org.gradle.launcher.cli.CommandLineActionFactory$WithLogging.execute(CommandLineActionFactory.java:205)
    at org.gradle.launcher.cli.CommandLineActionFactory$WithLogging.execute(CommandLineActionFactory.java:169)
    at org.gradle.launcher.Main.doAction(Main.java:33)
    at org.gradle.launcher.bootstrap.EntryPoint.run(EntryPoint.java:45)
    at sun.reflect.NativeMethodAccessorImpl.invoke0(Native Method)
    at sun.reflect.NativeMethodAccessorImpl.invoke(NativeMethodAccessorImpl.java:62)
    at sun.reflect.DelegatingMethodAccessorImpl.invoke(DelegatingMethodAccessorImpl.java:43)
    at java.lang.reflect.Method.invoke(Method.java:498)
    at org.gradle.launcher.bootstrap.ProcessBootstrap.runNoExit(ProcessBootstrap.java:55)
    at org.gradle.launcher.bootstrap.ProcessBootstrap.run(ProcessBootstrap.java:36)
    at org.gradle.launcher.GradleMain.main(GradleMain.java:23)
    at sun.reflect.NativeMethodAccessorImpl.invoke0(Native Method)
    at sun.reflect.NativeMethodAccessorImpl.invoke(NativeMethodAccessorImpl.java:62)
    at sun.reflect.DelegatingMethodAccessorImpl.invoke(DelegatingMethodAccessorImpl.java:43)
    at java.lang.reflect.Method.invoke(Method.java:498)
    at org.gradle.wrapper.BootstrapMainStarter.start(BootstrapMainStarter.java:33)
    at org.gradle.wrapper.WrapperExecutor.execute(WrapperExecutor.java:130)
    at org.gradle.wrapper.GradleWrapperMain.main(GradleWrapperMain.java:48)

    FAILURE: Build failed with an exception.

    * Where:
    Build file 'D:\test\New folder (2)\New folder\Casino File Manager\tmp\app\build.gradle' line: 4

    * What went wrong:
    A problem occurred evaluating project ':app'.
    > Invalid revision:

    * Try:
    Run with --stacktrace option to get the stack trace. Run with --info or --debug option to get more log output.
    Exec returned: 1
    Export failed! See details above.
    Loon Games LinkedIn Facebook Twitter - "Something bit me, gaah!"
  • hgy29hgy29 Maintainer
    Yes, it seems that gideros can't find a suitable build tools version from that android-sdk

    Likes: oleg

    +1 -1 (+1 / -0 ) Share on Facebook
  • @aditya do you have Android Studio installed? That seems to be the easiest way for Gideros to do what it needs to.

    Likes: SinisterSoft, oleg

    +1 -1 (+2 / -0 ) Share on Facebook
  • adityaaditya Member
    edited February 19
    Yup I do have android studio installed. I put the gideros android sdk path as the same path which android studio uses. The apk is being exported now, but it still gives the following error:

    [Fatal Error] :3:214: The value of attribute "name" associated with an element type "item" must not contain the '<' character.
    Could not read C:\Users\aditya.k\AppData\Local\Android\Sdk\platform-tools\api\annotations.zip
    java.io.IOException: Could not parse XML from android/accounts/annotations.xml
    at com.android.tools.lint.ExternalAnnotationRepository$AnnotationsDatabase.initializePackage(ExternalAnnotationRepository.java:658)
    at com.android.tools.lint.ExternalAnnotationRepository$AnnotationsDatabase.initializeFromJar(ExternalAnnotationRepository.java:601)
    at com.android.tools.lint.ExternalAnnotationRepository$AnnotationsDatabase.<init>(ExternalAnnotationRepository.java:402)
    at com.android.tools.lint.ExternalAnnotationRepository.getDatabase(ExternalAnnotationRepository.java:214)
    at com.android.tools.lint.ExternalAnnotationRepository.create(ExternalAnnotationRepository.java:153)
    at com.android.tools.lint.ExternalAnnotationRepository.get(ExternalAnnotationRepository.java:134)
    at com.android.tools.lint.EcjParser$EcjResolvedMethod.getAnnotations(EcjParser.java:1374)
    at com.android.tools.lint.checks.SupportAnnotationDetector$CallVisitor.checkCall(SupportAnnotationDetector.java:1688)
    at com.android.tools.lint.checks.SupportAnnotationDetector$CallVisitor.visitMethodInvocation(SupportAnnotationDetector.java:1659)
    at com.android.tools.lint.client.api.JavaVisitor$DispatchVisitor.visitMethodInvocation(JavaVisitor.java:1077)
    at com.android.tools.lint.client.api.JavaVisitor$DelegatingJavaVisitor.visitMethodInvocation(JavaVisitor.java:1445)
    at lombok.ast.MethodInvocation.accept(MethodInvocation.java:114)
    at lombok.ast.ExpressionStatement.accept(ExpressionStatement.java:63)
    at lombok.ast.Block.accept(Block.java:106)
    at lombok.ast.StaticInitializer.accept(StaticInitializer.java:63)
    at lombok.ast.NormalTypeBody.accept(NormalTypeBody.java:57)
    at lombok.ast.ClassDeclaration.accept(ClassDeclaration.java:239)
    at lombok.ast.CompilationUnit.accept(CompilationUnit.java:83)
    at com.android.tools.lint.client.api.JavaVisitor.visitFile(JavaVisitor.java:274)
    at com.android.tools.lint.client.api.LintDriver.checkJava(LintDriver.java:1529)
    at com.android.tools.lint.client.api.LintDriver.runFileDetectors(LintDriver.java:1063)
    at com.android.tools.lint.client.api.LintDriver.checkProject(LintDriver.java:908)
    at com.android.tools.lint.client.api.LintDriver.analyze(LintDriver.java:436)
    at com.android.tools.lint.client.api.LintDriver.analyze(LintDriver.java:377)
    at com.android.tools.lint.LintCliClient.run(LintCliClient.java:131)
    at com.android.build.gradle.internal.LintGradleClient.run(LintGradleClient.java:133)
    at com.android.build.gradle.internal.LintGradleClient$run.call(Unknown Source)
    at org.codehaus.groovy.runtime.callsite.CallSiteArray.defaultCall(CallSiteArray.java:48)
    at org.codehaus.groovy.runtime.callsite.AbstractCallSite.call(AbstractCallSite.java:113)
    at org.codehaus.groovy.runtime.callsite.AbstractCallSite.call(AbstractCallSite.java:125)
    at com.android.build.gradle.tasks.Lint.runLint(Lint.groovy:223)
    at sun.reflect.NativeMethodAccessorImpl.invoke0(Native Method)
    at sun.reflect.NativeMethodAccessorImpl.invoke(NativeMethodAccessorImpl.java:62)
    at sun.reflect.DelegatingMethodAccessorImpl.invoke(DelegatingMethodAccessorImpl.java:43)
    at java.lang.reflect.Method.invoke(Method.java:498)
    at org.codehaus.groovy.runtime.callsite.PogoMetaMethodSite$PogoCachedMethodSiteNoUnwrapNoCoerce.invoke(PogoMetaMethodSite.java:210)
    at org.codehaus.groovy.runtime.callsite.PogoMetaMethodSite.callCurrent(PogoMetaMethodSite.java:59)
    at org.codehaus.groovy.runtime.callsite.CallSiteArray.defaultCallCurrent(CallSiteArray.java:52)
    at org.codehaus.groovy.runtime.callsite.AbstractCallSite.callCurrent(AbstractCallSite.java:154)
    at org.codehaus.groovy.runtime.callsite.AbstractCallSite.callCurrent(AbstractCallSite.java:182)
    at com.android.build.gradle.tasks.Lint.lintSingleVariant(Lint.groovy:198)
    at com.android.build.gradle.tasks.Lint$lintSingleVariant$2.callCurrent(Unknown Source)
    at org.codehaus.groovy.runtime.callsite.CallSiteArray.defaultCallCurrent(CallSiteArray.java:52)
    at org.codehaus.groovy.runtime.callsite.AbstractCallSite.callCurrent(AbstractCallSite.java:154)
    at org.codehaus.groovy.runtime.callsite.AbstractCallSite.callCurrent(AbstractCallSite.java:174)
    at com.android.build.gradle.tasks.Lint.lint(Lint.groovy:77)
    at sun.reflect.NativeMethodAccessorImpl.invoke0(Native Method)
    at sun.reflect.NativeMethodAccessorImpl.invoke(NativeMethodAccessorImpl.java:62)
    at sun.reflect.DelegatingMethodAccessorImpl.invoke(DelegatingMethodAccessorImpl.java:43)
    at java.lang.reflect.Method.invoke(Method.java:498)
    at org.gradle.internal.reflect.JavaMethod.invoke(JavaMethod.java:75)
    at org.gradle.api.internal.project.taskfactory.AnnotationProcessingTaskFactory$StandardTaskAction.doExecute(AnnotationProcessingTaskFactory.java:228)
    at org.gradle.api.internal.project.taskfactory.AnnotationProcessingTaskFactory$StandardTaskAction.execute(AnnotationProcessingTaskFactory.java:221)
    at org.gradle.api.internal.project.taskfactory.AnnotationProcessingTaskFactory$StandardTaskAction.execute(AnnotationProcessingTaskFactory.java:210)
    at org.gradle.api.internal.AbstractTask$TaskActionWrapper.execute(AbstractTask.java:621)
    at org.gradle.api.internal.AbstractTask$TaskActionWrapper.execute(AbstractTask.java:604)
    at org.gradle.api.internal.tasks.execution.ExecuteActionsTaskExecuter.executeAction(ExecuteActionsTaskExecuter.java:80)
    at org.gradle.api.internal.tasks.execution.ExecuteActionsTaskExecuter.executeActions(ExecuteActionsTaskExecuter.java:61)
    at org.gradle.api.internal.tasks.execution.ExecuteActionsTaskExecuter.execute(ExecuteActionsTaskExecuter.java:46)
    at org.gradle.api.internal.tasks.execution.PostExecutionAnalysisTaskExecuter.execute(PostExecutionAnalysisTaskExecuter.java:35)
    at org.gradle.api.internal.tasks.execution.SkipUpToDateTaskExecuter.execute(SkipUpToDateTaskExecuter.java:66)
    at org.gradle.api.internal.tasks.execution.ValidatingTaskExecuter.execute(ValidatingTaskExecuter.java:58)
    at org.gradle.api.internal.tasks.execution.SkipEmptySourceFilesTaskExecuter.execute(SkipEmptySourceFilesTaskExecuter.java:52)
    at org.gradle.api.internal.tasks.execution.SkipTaskWithNoActionsExecuter.execute(SkipTaskWithNoActionsExecuter.java:52)
    at org.gradle.api.internal.tasks.execution.SkipOnlyIfTaskExecuter.execute(SkipOnlyIfTaskExecuter.java:53)
    at org.gradle.api.internal.tasks.execution.ExecuteAtMostOnceTaskExecuter.execute(ExecuteAtMostOnceTaskExecuter.java:43)
    at org.gradle.execution.taskgraph.DefaultTaskGraphExecuter$EventFiringTaskWorker.execute(DefaultTaskGraphExecuter.java:203)
    at org.gradle.execution.taskgraph.DefaultTaskGraphExecuter$EventFiringTaskWorker.execute(DefaultTaskGraphExecuter.java:185)
    at org.gradle.execution.taskgraph.AbstractTaskPlanExecutor$TaskExecutorWorker.processTask(AbstractTaskPlanExecutor.java:66)
    at org.gradle.execution.taskgraph.AbstractTaskPlanExecutor$TaskExecutorWorker.run(AbstractTaskPlanExecutor.java:50)
    at org.gradle.execution.taskgraph.DefaultTaskPlanExecutor.process(DefaultTaskPlanExecutor.java:25)
    at org.gradle.execution.taskgraph.DefaultTaskGraphExecuter.execute(DefaultTaskGraphExecuter.java:110)
    at org.gradle.execution.SelectedTaskExecutionAction.execute(SelectedTaskExecutionAction.java:37)
    at org.gradle.execution.DefaultBuildExecuter.execute(DefaultBuildExecuter.java:37)
    at org.gradle.execution.DefaultBuildExecuter.access$000(DefaultBuildExecuter.java:23)
    at org.gradle.execution.DefaultBuildExecuter$1.proceed(DefaultBuildExecuter.java:43)
    at org.gradle.execution.DryRunBuildExecutionAction.execute(DryRunBuildExecutionAction.java:32)
    at org.gradle.execution.DefaultBuildExecuter.execute(DefaultBuildExecuter.java:37)
    at org.gradle.execution.DefaultBuildExecuter.execute(DefaultBuildExecuter.java:30)
    at org.gradle.initialization.DefaultGradleLauncher$4.run(DefaultGradleLauncher.java:153)
    at org.gradle.internal.Factories$1.create(Factories.java:22)
    at org.gradle.internal.progress.DefaultBuildOperationExecutor.run(DefaultBuildOperationExecutor.java:91)
    at org.gradle.internal.progress.DefaultBuildOperationExecutor.run(DefaultBuildOperationExecutor.java:53)
    at org.gradle.initialization.DefaultGradleLauncher.doBuildStages(DefaultGradleLauncher.java:150)
    at org.gradle.initialization.DefaultGradleLauncher.access$200(DefaultGradleLauncher.java:32)
    at org.gradle.initialization.DefaultGradleLauncher$1.create(DefaultGradleLauncher.java:98)
    at org.gradle.initialization.DefaultGradleLauncher$1.create(DefaultGradleLauncher.java:92)
    at org.gradle.internal.progress.DefaultBuildOperationExecutor.run(DefaultBuildOperationExecutor.java:91)
    at org.gradle.internal.progress.DefaultBuildOperationExecutor.run(DefaultBuildOperationExecutor.java:63)
    at org.gradle.initialization.DefaultGradleLauncher.doBuild(DefaultGradleLauncher.java:92)
    at org.gradle.initialization.DefaultGradleLauncher.run(DefaultGradleLauncher.java:83)
    at org.gradle.launcher.exec.InProcessBuildActionExecuter$DefaultBuildController.run(InProcessBuildActionExecuter.java:99)
    at org.gradle.tooling.internal.provider.ExecuteBuildActionRunner.run(ExecuteBuildActionRunner.java:28)
    at org.gradle.launcher.exec.ChainingBuildActionRunner.run(ChainingBuildActionRunner.java:35)
    at org.gradle.launcher.exec.InProcessBuildActionExecuter.execute(InProcessBuildActionExecuter.java:48)
    at org.gradle.launcher.exec.InProcessBuildActionExecuter.execute(InProcessBuildActionExecuter.java:30)
    at org.gradle.launcher.exec.ContinuousBuildActionExecuter.execute(ContinuousBuildActionExecuter.java:81)
    at org.gradle.launcher.exec.ContinuousBuildActionExecuter.execute(ContinuousBuildActionExecuter.java:46)
    at org.gradle.launcher.exec.DaemonUsageSuggestingBuildActionExecuter.execute(DaemonUsageSuggestingBuildActionExecuter.java:51)
    at org.gradle.launcher.exec.DaemonUsageSuggestingBuildActionExecuter.execute(DaemonUsageSuggestingBuildActionExecuter.java:28)
    at org.gradle.launcher.cli.RunBuildAction.run(RunBuildAction.java:43)
    at org.gradle.internal.Actions$RunnableActionAdapter.execute(Actions.java:173)
    at org.gradle.launcher.cli.CommandLineActionFactory$ParseAndBuildAction.execute(CommandLineActionFactory.java:239)
    at org.gradle.launcher.cli.CommandLineActionFactory$ParseAndBuildAction.execute(CommandLineActionFactory.java:212)
    at org.gradle.launcher.cli.JavaRuntimeValidationAction.execute(JavaRuntimeValidationAction.java:35)
    at org.gradle.launcher.cli.JavaRuntimeValidationAction.execute(JavaRuntimeValidationAction.java:24)
    at org.gradle.launcher.cli.ExceptionReportingAction.execute(ExceptionReportingAction.java:33)
    at org.gradle.launcher.cli.ExceptionReportingAction.execute(ExceptionReportingAction.java:22)
    at org.gradle.launcher.cli.CommandLineActionFactory$WithLogging.execute(CommandLineActionFactory.java:205)
    at org.gradle.launcher.cli.CommandLineActionFactory$WithLogging.execute(CommandLineActionFactory.java:169)
    at org.gradle.launcher.Main.doAction(Main.java:33)
    at org.gradle.launcher.bootstrap.EntryPoint.run(EntryPoint.java:45)
    at sun.reflect.NativeMethodAccessorImpl.invoke0(Native Method)
    at sun.reflect.NativeMethodAccessorImpl.invoke(NativeMethodAccessorImpl.java:62)
    at sun.reflect.DelegatingMethodAccessorImpl.invoke(DelegatingMethodAccessorImpl.java:43)
    at java.lang.reflect.Method.invoke(Method.java:498)
    at org.gradle.launcher.bootstrap.ProcessBootstrap.runNoExit(ProcessBootstrap.java:55)
    at org.gradle.launcher.bootstrap.ProcessBootstrap.run(ProcessBootstrap.java:36)
    at org.gradle.launcher.GradleMain.main(GradleMain.java:23)
    at sun.reflect.NativeMethodAccessorImpl.invoke0(Native Method)
    at sun.reflect.NativeMethodAccessorImpl.invoke(NativeMethodAccessorImpl.java:62)
    at sun.reflect.DelegatingMethodAccessorImpl.invoke(DelegatingMethodAccessorImpl.java:43)
    at java.lang.reflect.Method.invoke(Method.java:498)
    at org.gradle.wrapper.BootstrapMainStarter.start(BootstrapMainStarter.java:33)
    at org.gradle.wrapper.WrapperExecutor.execute(WrapperExecutor.java:130)
    at org.gradle.wrapper.GradleWrapperMain.main(GradleWrapperMain.java:48)
    Loon Games LinkedIn Facebook Twitter - "Something bit me, gaah!"
  • olegoleg Member
    Try to open this path in Windows Explorer
    C:\Users\aditya.k\AppData\Local\Android\Sdk\platform-tools\api\annotations.zip
    I do not understand English
    I am writing with the help of a google translator

    my blog: https://simartinfo.blogspot.com
    my games:
    https://play.google.com/store/apps/developer?id=AndroidMobileGame+(indie)
    Слава Україні
  • The annotations.zip file is present (please check attached file).
    zip
    zip
    annotations.zip
    73K
    Loon Games LinkedIn Facebook Twitter - "Something bit me, gaah!"
Sign In or Register to comment.